Hi, I am trying to archive my IOS project which was working and archived earlier. Worked perfectly in-fact the app is already in app store. Now tried to update the app but it's failing to archive. Since I update to 3.20.G.A
Invalid "--pp-uuid" value "31162586-142B-4BBC-9D8E-583C98A9036B" For help, run: titanium help build Command /bin/sh failed with exit code 1it's the error I am getting. I tried to create a new certificate along with provision but no success. Still facing the same.When I tried to build the app from titanium studio I am getting
[ERROR] : ** BUILD FAILED ** [ERROR] : The following build commands failed: [ERROR] : CodeSign build/Release-iphoneos/yorubaFinal.app [ERROR] : (1 failurePlease suggest me some solution for building the app.